{"text_format":"1","workbook":"xlsx","n_sheets":8,"sheets":["GENEL BİLGİLER GİRİŞ","DATA","GSM 900","GSM 1800","UMTS 2100","LTE 1800","BAŞVURU FORMU-S1","BAŞVURU FORMU-S2"],"not_rendered":{"charts":0,"images":2,"macros":1,"external_links":0,"defined_names":75,"comments":0,"pivot_tables":0},"unopened":[],"bounds":{"document_bytes":16777216,"sheet_cells":100000,"rows_first":2000,"rows_last":500,"rows_between":2000,"halvings":0,"cell_chars":16384,"cell_head_chars":4096},"cells_cut":0,"cells_raw":0,"read":"whole","date_system":"1900"}

{"sheet":"GENEL BİLGİLER GİRİŞ","index":0,"n_rows":68,"n_cols":7,"rows_kept":68,"cut":false,"hidden":false,"merged":[[48,4,48,5],[55,2,55,8],[12,4,12,5],[14,4,14,5],[14,6,14,13],[16,4,16,5],[15,6,16,13],[18,4,18,5],[18,6,18,14],[12,6,12,14],[10,4,10,14],[22,4,22,14],[24,4,24,14],[42,2,42,8],[46,4,46,5]]}
[]
[null,"İşletmeci Bilgileri"]
[null,"İşletmeci Adı:"]
[]
[null,"Adresi:"]
[]
[null,"Telefon ve Faks Numaraları:"]
[]
[null,"E-Posta Adresi:"]
[null,"Başvuru Bilgileri"]
[null,"Sayı:",null,null,"Başvuru Tipi için Aaçıklama"]
[]
[null,"Tarih:",null,null,"YENİ: ",null,"Yeni istasyon başvurusu yapılacağında seçilecek"]
[]
[null,"Başvuru Tipi:",null,null,"İLAVE: ",null,"Sisteme yeni sektör, yeni kabinet veya yeni teknoloji ekleneceği zaman seçilecek"]
[null,null,null,null,null,null,"İlave kategorisinde yer almayan her türlüd eğişikliğin yapılacak olması durumunda seçilecek"]
[null,"Sistem Türü:",null,null,"DEĞİŞİKLİK: "]
[]
[null,null,null,null,"İPTAL VE YENİ: ",null,"Mevcut bir istasyonun sökülüp farklı bir koordinatta yeni istasyon başvurusu yapılacağında seçilecek"]
[]
[]
[null,"Mevcut İstasyon Bilgileri"]
[null,"İstasyonun faaliyete geçirildiği tarih:",null,null,"Mevcut İstasyon Bilgileri için Aaçıklama"]
[]
[null,"BTHK öncesi başvuru yapılma durumu:",null,null,"En son onay alınan Kurumun onay bilgileri belirtilecek"]
[]
[null,"En son başvuru yapılan Kurum:"]
[]
[null,"Başvuru No:"]
[]
[null,"Başvuru Tarihi:"]
[]
[null,"Başvuru onay durumu:"]
[]
[null,"Onay veren Kurum:"]
[]
[null,"Onay Tarihi:"]
[]
[null,"Onay No:"]
[]
[null,"İstasyonda Aktif Olan Sistemler:"]
[null,"Coğrafi Bilgiler"]
[null,"İstasyonun bulunacağı açık adres:"]
[]
[null,"Site No:"]
[]
[null,"Enlem (Derece/Dakika/Saniye) :",null,null,"Ör. 35° 14'12.97\"N"]
[]
[null," Boylam (Derece/Dakika/Saniye):",null,null,"Ör. 33°29'12.28\"E"]
[]
[null,"Sistem Anten Bilgileri"]
[null,"Sistemde Kullanılacak Toplam Anten Sayısı:"]
[null,"Transmisyon Bilgileri"]
[null,"Transmisyon Türü:"]
[]
[null,"Açıklamalar"]
[]
[null,"Planlanan Montaj Esasları"]
[]
[null,"Yansıtıcı Levha Kullanımı:"]
[]
[null,"Sivil Havacılık Tedbirleri:"]
[]
[null,"Paratoner:"]
[]
[null,"Topraklama Sistemi:"]
[]
[null,"Antenlerde Görsel Gizleme"]

{"sheet":"DATA","index":1,"n_rows":37,"n_cols":65,"rows_kept":37,"cut":false,"hidden":true,"merged":[[1,33,1,39],[1,41,1,47],[1,49,1,55],[1,57,1,63],[11,33,11,39],[11,41,11,47],[11,49,11,55],[11,57,11,63]]}
[]
[null,null,null,null,null,null,null,null,null,null,null,null,null,null,null,null,null,null,"LEVHA",null,"HAVACILIK",null,"PARATONER",null,"TOPRAKLAMA",null,"ERİSİM",null,null,null,null,null,null,"GSM 900",null,null,null,null,null,null,null,"GSM 1800",null,null,null,null,null,null,null,"UMTS 2100",null,null,null,null,null,null,null,"LTE 1800"]
[null,1,null,2,null,3,null,1,null,2,null,1,null,2,null,1,"(                   )",3,null,4,null,2,null,3,null,4,null,5,null,2,null,"_",null,"   ",4,null,2,null,4,null,4,null,1,null,4,null,1,null,1,"   ",4,null,4,null,4,null,1,null,3,null,3,null,3,null,4]
["Yeni",null,"Mevcut (x)",null,"Mevcut (x)",null,"Mevcut (x)",null,"Başvuru yapıldı",null,"Telefon Dairesi",null,"Onaylı",null,"Telefon Dairesi",null,"Fiber",null,"GEREKMEMEKTEDİR",null,"GEREKMEMEKTEDİR",null,"GEREKMEMEKTEDİR",null,"GEREKMEMEKTEDİR",null,"GEREKMEMEKTEDİR",null,"KATHREIN",null,null,"GSM-900 MHz",null,"Single-Band",null,"Single-Band",null,"Single-Band",null,"Single-Band",null,"Single-Band",null,"Single-Band",null,"Single-Band",null,"Single-Band",null,"Single-Band",null,"Single-Band",null,"Single-Band",null,"Single-Band",null,"Single-Band",null,"Single-Band",null,"Single-Band",null,"Single-Band"]
["İlave",null,"Yeni Müraccat (x)",null,"Yeni Müraccat (x)",null,"Yeni Müraccat (x)",null,"Başvuru yapılmadı",null,"BTHK",null,"Onaysız",null,"BTHK",null,"Radyolink\n",null,"KULLANILMAYACAKTIR",null,"KULLANILMAYACAKTIR",null,"KULLANILMAYACAKTIR",null,"KULLANILMAYACAKTIR",null,"KULLANILMAYACAKTIR",null,"ERICSSON",null,null,"GSM-1800 MHz",null,"Dual-Band",null,"Dual-Band",null,"Dual-Band",null,"Dual-Band",null,"Dual-Band",null,"Dual-Band",null,"Dual-Band",null,"Dual-Band",null,"Dual-Band",null,"Dual-Band",null,"Dual-Band",null,"Dual-Band",null,"Dual-Band",null,"Dual-Band",null,"Dual-Band",null,"Dual-Band"]
["Değişiklik",null,"İlave (x)",null,"İlave (x)",null,"İlave (x)",null,null,null,null,null,null,null,"BUB",null,"Diğer",null,"MEVCUTTUR",null,"MEVCUTTUR",null,"MEVCUTTUR",null,"MEVCUTTUR",null,"MEVCUTTUR",null,0,null,null,"UMTS-2100 MHz",null,"Triple-Band",null,"Triple-Band",null,"Triple-Band",null,"Triple-Band",null,"Triple-Band",null,"Triple-Band",null,"Triple-Band",null,"Triple-Band",null,"Triple-Band",null,"Triple-Band",null,"Triple-Band",null,"Triple-Band",null,"Triple-Band",null,"Triple-Band",null,"Triple-Band",null,"Triple-Band"]
["İptal ve Yeni",null,"Değişiklik (x)",null,"Değişiklik (x)",null,"Değişiklik (x)",null,null,null,null,null,null,null,null,null,null,null,"YETKİSİZ ERİSİM MÜMKÜN DEĞİLDİR",null,"YETKİSİZ ERİSİM MÜMKÜN DEĞİLDİR",null,"YETKİSİZ ERİSİM MÜMKÜN DEĞİLDİR",null,"YETKİSİZ ERİSİM MÜMKÜN DEĞİLDİR",null,"YETKİSİZ ERİSİM MÜMKÜN DEĞİLDİR",null,0,null,null,"LTE-1800 MHz",null,"Multi-Band",null,"Multi-Band",null,"Multi-Band",null,"Multi-Band",null,"Multi-Band",null,"Multi-Band",null,"Multi-Band",null,"Multi-Band",null,"Multi-Band",null,"Multi-Band",null,"Multi-Band",null,"Multi-Band",null,"Multi-Band",null,"Multi-Band",null,"Multi-Band",null,"Multi-Band"]
[null,null,null,null,null,null,null,null,null,null,null,null,null,null,null,null,null,null,0,null,"UÇAK İKAZ LAMBASINA GEREK YOKTUR",null,0,null,0,null,0,null,0]
[null,null,null,null,null,null,null,null,null,null,null,null,null,null,null,null,"(                   )",null,0,null,0,null,0,null,0,null,0,null,0]
[null,null,null,null,null,null,null,null,null,null,null,null,null,null,null,null,"(                   )",null,0,null,0,null,0,null,0,null,0,null,0]
[null,null,"*Mevcut İstasyon Bilgileri bölümü doldurulacaktır",null,"*Mevcut İstasyon Bilgileri bölümü doldurulacaktır",null,"*Mevcut İstasyon Bilgileri bölümü doldurulacaktır",null,null,null,null,null,null,null,null,null,"1-Kullanılması planlanan frekansın tahsisli  olmaması durumunda öncelikle Radyolink Frekans Tahsis Başvurusu yapılacaktır.          2-Radyolink Sistemleri İçin Telsiz Kurma Ve İşletme Başvuru Formu doldurulacaktır",null,0,null,0,null,0,null,0,null,0]
[null,null,null,null,null,null,null,null,null,null,null,null,null,null,null,null,"Açıklamalar Bölümü doldurulacaktır ",null,null,null,null,null,null,null,null,null,null,null,null,null,null,null,null,"GSM 900",null,null,null,null,null,null,null,"GSM 1800",null,null,null,null,null,null,null,"UMTS 2100",null,null,null,null,null,null,null,"LTE 1800"]
[null,null,null,null,null,null,null,null,null,null,null,null,null,null,null,null,null,null,null,null,null,null,null,null,null,null,null,null,null,null,null,null,null,"   ",2,null,4,null,4,null,4,null,1,null,4,null,1,null,1,"   ",4,null,4,null,4,null,1,null,3,null,3,null,3,null,4]
[null,null,null,null,null,null,null,null,null,null,null,null,null,null,null,null,null,null,null,null,null,null,null,null,null,null,null,null,null,null,null,null,null,"Single-Band",null,"Single-Band",null,"Single-Band",null,"Single-Band",null,"Single-Band",null,"Single-Band",null,"Single-Band",null,"Single-Band",null,"Single-Band",null,"Single-Band",null,"Single-Band",null,"Single-Band",null,"Single-Band",null,"Single-Band",null,"Single-Band",null,"Single-Band"]
[null,null,null,null,null,null,null,null,null,null,null,null,null,null,null,null,null,null,null,null,null,null,null,null,null,null,null,null,null,null,null,null,null,"Dual-Band",null,"Dual-Band",null,"Dual-Band",null,"Dual-Band",null,"Dual-Band",null,"Dual-Band",null,"Dual-Band",null,"Dual-Band",null,"Dual-Band",null,"Dual-Band",null,"Dual-Band",null,"Dual-Band",null,"Dual-Band",null,"Dual-Band",null,"Dual-Band",null,"Dual-Band"]
[null,null,null,null,null,null,null,null,null,null,null,null,null,null,null,null,null,null,null,null,null,null,null,null,null,null,null,null,null,null,null,null,null,"Triple-Band",null,"Triple-Band",null,"Triple-Band",null,"Triple-Band",null,"Triple-Band",null,"Triple-Band",null,"Triple-Band",null,"Triple-Band",null,"Triple-Band",null,"Triple-Band",null,"Triple-Band",null,"Triple-Band",null,"Triple-Band",null,"Triple-Band",null,"Triple-Band",null,"Triple-Band"]
[null,1,null,null,"İşletmeci firmanın istasyon için önceden yapılmış herhangi bir başvurusu bulunmamaktadır.",null,null,null,null,null,null,null,null,null,null,null,null,null,null,null,null,null,null,null,null,null,null,null,null,null,null,null,null,"Multi-Band",null,"Multi-Band",null,"Multi-Band",null,"Multi-Band",null,"Multi-Band",null,"Multi-Band",null,"Multi-Band",null,"Multi-Band",null,"Multi-Band",null,"Multi-Band",null,"Multi-Band",null,"Multi-Band",null,"Multi-Band",null,"Multi-Band",null,"Multi-Band",null,"Multi-Band"]
["BULUNMAKTADIR"]
["BULUNMAMAKTADIR"]
[]
[]
[]
[]
[]
[]
[]
[null,1,null,null,null,1]
["2G",null,null,null,"Hücresel Sistem"]
["3G",null,null,null,"Telsiz Sistemi"]
["LTE",null,null,null,"Radyo"]
["2G & 3G",null,null,null,"TV Vericileri"]
["2G & LTE",null,null,null,0]
["3G & LTE",null,null,null,0]
["2G & 3G & LTE"]
[0]
[0]
[0]

{"sheet":"GSM 900","index":2,"n_rows":36,"n_cols":15,"rows_kept":36,"cut":false,"hidden":false,"merged":[[15,10,15,12],[15,14,15,16],[1,0,36,0],[15,2,15,4],[15,6,15,8]]}
[]
["GSM 900","Sistem Bilgileri","RBS 1",null,"RBS 2"]
[null,"Marka:"]
[]
[null,"Model:"]
[]
[null,"Katalog Çıkış Gücü (W):"]
[]
[null,"Cihazın desteklediği Maksimum Kanal Sayısı:"]
[]
[null,"Kullanılacak Kanal Sayısı:"]
[]
[null,"Tek Kanala ait Band Genişliği (KHz):"]
[]
[]
[null,"Sektör Bilgileri","Sektör 1",null,null,null,"Sektör 2",null,null,null,"Sektör 3",null,null,null,"Sektör 4"]
[]
[null,"Anten sayısı:"]
[]
[null,"Markası:"]
[]
[null,"Modeli:"]
[]
[null,"Band Sayısı (ör. Single-Band, Dual-Band):"]
[]
[null,"Antenin Yüksekliği (m)(1):"]
[]
[null,"Kazancı (dBi):"]
[]
[null,"Kullanılacak Çıkış Gücü (W):"]
[]
[null,"Yöneliş (Azimuth)(o):"]
[]
[null,"Mekanik Eğimi (Tilt)(o):"]
[]
[null,"Elektronik Eğimi (Tilt)(o):"]

{"sheet":"GSM 1800","index":3,"n_rows":36,"n_cols":15,"rows_kept":36,"cut":false,"hidden":false,"merged":[[15,14,15,16],[1,0,36,0],[15,2,15,4],[15,6,15,8],[15,10,15,12]]}
[]
["GSM 1800","Sistem Bilgileri","RBS 1",null,"RBS 2"]
[null,"Marka:"]
[]
[null,"Model:"]
[]
[null,"Katalog Çıkış Gücü (W):"]
[]
[null,"Cihazın desteklediği Maksimum Kanal Sayısı:"]
[]
[null,"Kullanılacak Kanal Sayısı:"]
[]
[null,"Tek Kanala ait Band Genişliği (KHz):"]
[]
[]
[null,"Sektör Bilgileri","Sektör 1",null,null,null,"Sektör 2",null,null,null,"Sektör 3",null,null,null,"Sektör 4"]
[]
[null,"Anten sayısı:"]
[]
[null,"Markası:"]
[]
[null,"Modeli:"]
[]
[null,"Band Sayısı:"]
[]
[null,"Antenin Yüksekliği (m)(1):"]
[]
[null,"Kazancı (dBi):"]
[]
[null,"Kullanılacak Çıkış Gücü (W):"]
[]
[null,"Yöneliş (Azimuth)(o):"]
[]
[null,"Mekanik Eğimi (Tilt)(o):"]
[]
[null,"Elektronik Eğimi (Tilt)(o):"]

{"sheet":"UMTS 2100","index":4,"n_rows":36,"n_cols":15,"rows_kept":36,"cut":false,"hidden":false,"merged":[[15,14,15,16],[1,0,36,0],[15,2,15,4],[15,6,15,8],[15,10,15,12]]}
[]
["UMTS 2100","Sistem Bilgileri","RBS 1",null,"RBS 2"]
[null,"Marka:"]
[]
[null,"Model:"]
[]
[null,"Katalog Çıkış Gücü (W):"]
[]
[null,"Cihazın desteklediği Maksimum Kanal Sayısı:"]
[]
[null,"Kullanılacak Kanal Sayısı:"]
[]
[null,"Tek Kanala ait Band Genişliği (MHz):"]
[]
[]
[null,"Sektör Bilgileri","Sektör 1",null,null,null,"Sektör 2",null,null,null,"Sektör 3",null,null,null,"Sektör 4"]
[]
[null,"Anten sayısı:"]
[]
[null,"Markası:"]
[]
[null,"Modeli:"]
[]
[null,"Band Sayısı:"]
[]
[null,"Antenin Yüksekliği (m)(1):"]
[]
[null,"Kazancı (dBi):"]
[]
[null,"Kullanılacak Çıkış Gücü (W):"]
[]
[null,"Yöneliş (Azimuth)(o):"]
[]
[null,"Mekanik Eğimi (Tilt)(o):"]
[]
[null,"Elektronik Eğimi (Tilt)(o):"]

{"sheet":"LTE 1800","index":5,"n_rows":36,"n_cols":15,"rows_kept":36,"cut":false,"hidden":false,"merged":[[15,14,15,16],[1,0,36,0],[15,2,15,4],[15,6,15,8],[15,10,15,12]]}
[]
["LTE 1800","Sistem Bilgileri","RBS 1",null,"RBS 2"]
[null,"Marka:"]
[]
[null,"Model:"]
[]
[null,"Katalog Çıkış Gücü (W):"]
[]
[null,"Cihazın desteklediği Maksimum Kanal Sayısı:"]
[]
[null,"Kullanılacak Kanal Sayısı:"]
[]
[null,"Tek Kanala ait Band Genişliği (MHz):"]
[]
[]
[null,"Sektör Bilgileri","Sektör 1",null,null,null,"Sektör 2",null,null,null,"Sektör 3",null,null,null,"Sektör 4"]
[]
[null,"Anten sayısı:"]
[]
[null,"Markası:"]
[]
[null,"Modeli:"]
[]
[null,"Band Sayısı:"]
[]
[null,"Antenin Yüksekliği (m)(1):"]
[]
[null,"Kazancı (dBi):"]
[]
[null,"Kullanılacak Çıkış Gücü (W):"]
[]
[null,"Yöneliş (Azimuth)(o):"]
[]
[null,"Mekanik Eğimi (Tilt)(o):"]
[]
[null,"Elektronik Eğimi (Tilt)(o):"]

{"sheet":"BAŞVURU FORMU-S1","index":6,"n_rows":103,"n_cols":10,"rows_kept":103,"cut":false,"hidden":false,"merged":[[44,2,44,9],[41,0,41,9],[18,0,18,1],[20,2,20,3],[29,5,29,9],[30,5,30,9],[31,0,31,9],[20,4,20,5],[20,6,20,7],[20,8,20,9],[25,3,25,5],[25,6,25,7],[43,2,43,9],[3,0,3,9],[1,0,1,9],[4,0,4,9],[36,0,40,9],[21,0,21,9],[22,0,22,2],[22,3,22,9],[25,8,25,9],[26,0,26,9],[16,0,16,1],[14,2,14,9],[15,2,15,9],[16,2,16,9],[17,0,17,9],[0,1,0,8],[2,1,2,8],[19,2,19,3],[19,4,19,5],[19,6,19,7],[19,8,19,9],[5,0,11,9],[12,0,12,9],[13,0,13,1],[14,0,14,1],[15,0,15,1],[13,2,13,9],[18,2,18,3],[18,4,18,5],[18,6,18,9],[19,0,19,1],[94,5,94,6],[91,5,91,6],[23,0,23,2],[23,3,23,4],[23,5,23,6],[24,0,24,2],[24,3,24,9],[29,2,29,4],[30,2,30,4],[33,0,33,9],[34,0,34,1],[34,2,34,3],[34,4,34,7],[80,1,80,9],[35,0,35,9],[29,0,30,1],[83,7,83,9],[85,5,85,6],[88,5,88,6],[67,2,67,7],[71,1,71,9],[69,1,69,9],[70,1,70,9],[75,1,77,7],[53,2,53,7],[54,2,57,7],[46,2,46,9],[25,0,25,2],[28,2,28,9],[32,0,32,4],[32,5,32,9],[28,0,28,1],[27,0,27,1],[27,2,27,9],[45,2,45,9],[43,0,43,1],[44,0,44,1],[45,0,45,1],[42,0,42,1],[42,2,42,9]]}
[]
["BAZ İSTASYONLARI İÇİN TELSİZ KURMA VE İŞLETME İZNİ BAŞVURU FORMU"]
[]
["KUZEY KIBRIS TÜRK CUMHURİYETİ "]
["BİLGİ TEKNOLOJİLERİ VE HABERLEŞME KURUMUNA"]
["Şirketimiz, Elektronik Haberleşme Yasası çerçevesinde faaliyet gösteren bir haberleşme sağlayıcı olup, aşağıda belirtilen bilgiler kapsamında telsiz kurulumu ve işletimi gerçekleştirilmek istenmektedir. \n \nSöz konusu faaliyetlerin uygulanmasında, Elektronik Haberleşme Yasası ve yayınlanacak Tüzükler ile belirlenecek şartları yerine getireceğimizi, ilgili idari ücretleri ödeyeceğimizi, işbu formda belirtilen bilgilerde herhangi bir değişiklik olması halinde Kurumu derhal bilgilendireceğimizi taahhüt eder, tarafımıza işbu başvuru dilekçemizde belirttiğimiz bilgiler kapsamında telsiz kurma ve işletme izninin verilmesini talep ederiz."]
[]
[]
[]
[]
[]
[]
["A- İşletmeci Bilgileri"]
["İşletmeci Adı:",null,{"$f":"'GENEL BİLGİLER GİRİŞ'!C3","v":0}]
["Adresi:",null,{"$f":"'GENEL BİLGİLER GİRİŞ'!C5","v":0}]
["Telefon ve Faks Numaraları:",null,{"$f":"'GENEL BİLGİLER GİRİŞ'!C7","v":0}]
["E-Posta Adresi:",null,{"$f":"'GENEL BİLGİLER GİRİŞ'!C9","v":0}]
["B- Başvuru Bilgileri"]
["Sayı:",null,{"$f":"'GENEL BİLGİLER GİRİŞ'!C11","v":0},null,"Tarih:",null,{"$f":"'GENEL BİLGİLER GİRİŞ'!C13","v":"00:00:00"}]
["Başvuru Tipi",null,{"$f":"IF(DATA!B3=1,DATA!A3,IF(DATA!B3=2,DATA!A4,IF(DATA!B3=3,DATA!A5,IF(DATA!B3=4,DATA!A6,IF(DATA!B3=5,DATA!A7,NA())))))","v":0},null,null,null,null,null,{"$f":"IF(DATA!H3=1,DATA!E3,IF(DATA!H3=2,DATA!E4,IF(DATA!H3=3,DATA!E5,IF(DATA!H3=4,DATA!E6,IF(DATA!H3=5,DATA!E7,NA())))))","v":0}]
[null,null,{"$f":"IF(DATA!B3=1,DATA!A10,IF(DATA!B3=2,DATA!A11,IF(DATA!B3=3,DATA!A12,IF(DATA!B3=4,DATA!A13,IF(DATA!B3=5,DATA!A14,NA())))))","v":0},null,null,null,{"$f":"IF(DATA!F3=1,DATA!E10,IF(DATA!F3=2,DATA!E11,IF(DATA!F3=3,DATA!E12,IF(DATA!F3=4,DATA!E13,IF(DATA!F3=5,DATA!E14,NA())))))","v":0},null,{"$f":"IF(DATA!H3=1,DATA!G10,IF(DATA!H3=2,DATA!G11,IF(DATA!H3=3,DATA!G12,IF(DATA!H3=4,DATA!G13,IF(DATA!H3=5,DATA!G14,NA())))))","v":0}]
["C- Mevcut İstasyon Bilgileri (En son onay alınan Kurum)"]
["İstasyonun faaliyete geçirildiği tarih:",null,null,{"$f":"'GENEL BİLGİLER GİRİŞ'!C23","v":"00:00:00"}]
["Başvuru yapılan Kurum:",null,null,{"$f":"IF(DATA!L3=1,DATA!K3,IF(DATA!L3=2,DATA!K4,IF(DATA!L3=3,DATA!K5,NA())))","v":0},null,"Başvuru Tarihi:",null,{"$f":"'GENEL BİLGİLER GİRİŞ'!C31","v":"00:00:00"},"No:",{"$f":"'GENEL BİLGİLER GİRİŞ'!C29","v":"00:00:00"}]
["Başvuru onay durumu:",null,null,{"$f":"IF(DATA!N3=1,DATA!M3,IF(DATA!N3=2,DATA!M4,IF(DATA!N3=3,DATA!M5,NA())))","v":"Onaylı"}]
["Onay veren Kurum:",null,null,{"$f":"IF(DATA!P3=1,DATA!O3,IF(DATA!P3=2,DATA!O4,IF(DATA!P3=3,DATA!O5,IF(DATA!P3=4,DATA!O6,NA()))))","v":0},null,null,"Onay Tarihi:",null,{"$f":"'GENEL BİLGİLER GİRİŞ'!C37","v":"00:00:00"}]
["D- Coğrafi Bilgiler"]
["İstasyonun bulunacağı açık adres:",null,{"$f":"'GENEL BİLGİLER GİRİŞ'!C43","v":0}]
["Site No:",null,{"$f":"'GENEL BİLGİLER GİRİŞ'!C45","v":0}]
["KOORDİNATLAR",null,"Enlem:",null,null,{"$f":"'GENEL BİLGİLER GİRİŞ'!C47","v":0}]
[null,null,"Boylam:",null,null,{"$f":"'GENEL BİLGİLER GİRİŞ'!C49","v":0}]
["E- Sistem Anten Bilgileri"]
["Sistemde Kullanılacak Toplam Anten Sayısı:",null,null,null,null,{"$f":"'GENEL BİLGİLER GİRİŞ'!C52","v":0}]
["F- Transmisyon Bilgileri"]
["Transmisyon Türü:",null,{"$f":"IF(DATA!R3=1,DATA!Q3,IF(DATA!R3=2,DATA!Q4,IF(DATA!R3=3,DATA!Q5,IF(DATA!R3=4,DATA!Q6,NA()))))","v":"Radyolink\n"},null,{"$f":"IF(DATA!R3=1,DATA!Q9,IF(DATA!R3=2,DATA!Q10,IF(DATA!R3=3,DATA!Q11,IF(DATA!R3=4,DATA!Q12,NA()))))","v":"1-Kullanılması planlanan frekansın tahsisli  olmaması durumunda öncelikle Radyolink Frekans Tahsis Başvurusu yapılacaktır.          2-Radyolink Sistemleri İçin Telsiz Kurma Ve İşletme Başvuru Formu doldurulacaktır"}]
["G- Açıklamalar"]
[{"$f":"'GENEL BİLGİLER GİRİŞ'!C56","v":0}]
[]
[]
[]
[]
["H- Montaj Esasları"]
["Yansıtıcı Levha Kullanımı:",null,{"$f":"IF(DATA!T3=1,DATA!S3,IF(DATA!T3=2,DATA!S4,IF(DATA!T3=3,DATA!S5,IF(DATA!T3=4,DATA!S6,IF(DATA!T3=5,DATA!S7,NA())))))","v":"MEVCUTTUR"}]
["Sivil Havacılık Tedbirleri:",null,{"$f":"IF(DATA!V3=1,DATA!U3,IF(DATA!V3=2,DATA!U4,IF(DATA!V3=3,DATA!U5,IF(DATA!V3=4,DATA!U6,IF(DATA!V3=5,DATA!U7,NA())))))","v":"GEREKMEMEKTEDİR"}]
["Paratoner:",null,{"$f":"IF(DATA!X3=1,DATA!W3,IF(DATA!X3=2,DATA!W4,IF(DATA!X3=3,DATA!W5,IF(DATA!X3=4,DATA!W6,IF(DATA!X3=5,DATA!W7,NA())))))","v":"KULLANILMAYACAKTIR"}]
["Topraklama Sistemi:",null,{"$f":"IF(DATA!Z3=1,DATA!Y3,IF(DATA!Z3=2,DATA!Y4,IF(DATA!Z3=3,DATA!Y5,IF(DATA!Z3=4,DATA!Y6,IF(DATA!Z3=5,DATA!Y7,NA())))))","v":"MEVCUTTUR"}]
["Yetkisiz Erişimin Engellenmesi:",null,"YETKİSİZ ERİŞİMİN ENGELLENMESİ İÇİN GEREKLİ TEDBİRLERİN ALINACAĞINI TAAHHÜT EDERİZ"]
[]
[]
["FRM.023 / 10.09.2014 / Rev. No:00 /  Rev. Tarihi:---"]
[]
[]
[]
[null,null,"R- Güvenlik Mesafesi Hesabı Formülü"]
[]
[]
[]
[]
["Önemli Notlar:"]
["·         Güvenlik mesafesi hesaplamalarında kullanılacak olan elektrik alan limit değeri, aşağıda verilen tabloda açıklanmıştır."]
[]
[]
[]
[]
[]
[]
[]
[null,null,"(2) GSM 900 için 10.23V/m, GSM 1800 ve UMTS 2100 için 15V/m olarak  kullanılacaktır"]
[]
[null,"·         Güvenlik mesafesi hesaplaması kullanılması planlanan tüm antenler için ayrı ayrı yapılmalı;"]
[null,"·         Sektörlerde birden fazla anten bulunması durumunda, hesaplanan en yüksek değerdeki güvenlik mesafesi baz alınmalı;"]
[null,"·         Sağlık Kuruluşları, okul öncesi ve temel eğitim kuruluşlarının bulunduğu yerleşim bölgelerinde güvenlik mesafesi hesaplamasında bahçe sınırları dikkate alınmalı.  "]
[]
[]
[null,"Ekler:"]
["(1)","İstasyonun kurulmasının planlandığı bölgeye ait fotoğraflama ve kuş bakışı harita gösterimi (İstasyonun bina üzerine kurulmasının planlanması durumunda, tüm binayı görüntüleyecek şekilde yapılacak güncel fotoğraflama)"]
[]
[]
["(2)","Antenlerin yayın paternleri ve buna bağlı güvenlik mesafesinin üstten ve profilden görüntüleri"]
["(3)","Sistemde kullanılacak olan antenler ve telsiz sistemleri ile ilgili üretici firma tarafından hazırlanan teknik dökümanlar"]
["(4)","Her anntenin cephesinin baktığı yöne karşılık gelen güncel fotoğraflama gösterimi"]
[]
[]
[null,null,null,null,null,null,null,"Şirket Temsile Yetkili Kişi"]
[]
[null,null,null,null,null,"Adı-Soyadı:  "]
[]
[]
[null,null,null,null,null,"İmza:"]
[]
[]
[null,null,null,null,null,"Kaşe:"]
[]
[]
[null,null,null,null,null,"Tarih:"]
[]
[]
[]
[]
[]
[]
[]
["FRM.023 / 10.09.2014 / Rev. No:00 /  Rev. Tarihi:---"]

{"sheet":"BAŞVURU FORMU-S2","index":7,"n_rows":86,"n_cols":11,"rows_kept":86,"cut":false,"hidden":false,"merged":[[9,7,9,8],[9,9,9,10],[8,1,8,10],[7,1,7,3],[53,1,53,2],[34,1,34,2],[11,1,11,2],[12,1,12,2],[9,1,9,2],[9,3,9,4],[10,1,10,2],[36,1,36,2],[33,1,33,2],[35,1,35,2],[31,1,31,2],[32,1,32,2],[54,1,54,2],[58,1,58,2],[59,1,59,2],[38,1,38,2],[39,1,39,2],[41,1,41,2],[75,1,75,2],[55,1,55,2],[57,1,57,2],[60,1,60,2],[61,1,61,2],[63,1,63,2],[1,1,1,3],[0,1,0,5],[19,1,19,2],[0,0,19,0],[15,1,15,2],[2,1,2,3],[3,1,3,3],[4,1,4,3],[5,1,5,3],[6,1,6,3],[18,1,18,2],[16,1,16,2],[17,1,17,2],[13,1,13,2],[14,1,14,2],[9,5,9,6],[22,0,41,0],[22,1,22,5],[23,1,23,3],[24,1,24,3],[25,1,25,3],[26,1,26,3],[27,1,27,3],[28,1,28,3],[29,1,29,3],[30,1,30,10],[31,3,31,4],[31,5,31,6],[31,7,31,8],[31,9,31,10],[37,1,37,2],[40,1,40,2],[44,0,63,0],[44,1,44,5],[45,1,45,3],[46,1,46,3],[47,1,47,3],[48,1,48,3],[49,1,49,3],[50,1,50,3],[51,1,51,3],[52,1,52,10],[53,3,53,4],[53,5,53,6],[53,7,53,8],[53,9,53,10],[56,1,56,2],[62,1,62,2],[66,0,85,0],[66,1,66,5],[67,1,67,3],[68,1,68,3],[69,1,69,3],[70,1,70,3],[71,1,71,3],[72,1,72,3],[73,1,73,3],[74,1,74,10],[75,3,75,4],[75,5,75,6],[75,7,75,8],[75,9,75,10],[83,1,83,2],[84,1,84,2],[85,1,85,2],[76,1,76,2],[77,1,77,2],[78,1,78,2],[79,1,79,2],[80,1,80,2],[81,1,81,2],[82,1,82,2]]}
["GSM 900","I- Sistem Bilgileri"]
[null,"RBS BİLGİLERİ",null,null,"RBS 1","RBS 2"]
[null,"Marka:",null,null,{"$f":"'GSM 900'!$C$3","v":0},{"$f":"'GSM 900'!$E$3","v":0}]
[null,"Model:",null,null,{"$f":"'GSM 900'!$C$5","v":0},{"$f":"'GSM 900'!$E$5","v":0}]
[null,"Katalog Çıkış Gücü (W):",null,null,{"$f":"'GSM 900'!$C$7","v":0},{"$f":"'GSM 900'!$E$7","v":0}]
[null,"Cihazın Desteklediği Maksimum Kanal Sayısı:",null,null,{"$f":"'GSM 900'!$C$9","v":0},{"$f":"'GSM 900'!$E$9","v":0}]
[null,"Kullanılacak Kanal Sayısı:",null,null,{"$f":"'GSM 900'!$C$11","v":0},{"$f":"'GSM 900'!$E$11","v":0}]
[null,"Tek Kanala ait Band Genişliği (KHz):",null,null,{"$f":"'GSM 900'!$C$13","v":0},{"$f":"'GSM 900'!$E$13","v":0}]
[null,"J- Sektör Bilgileri"]
[null,"ANTEN BİLGİLERİ",null,"Sektör 1",null,"Sektör 2",null,"Sektör 3",null,"Sektör 4"]
[null,"Anten sayısı:",null,{"$f":"'GSM 900'!$C$18","v":0},{"$f":"'GSM 900'!$E$18","v":0},{"$f":"'GSM 900'!$G$18","v":0},{"$f":"'GSM 900'!$I$18","v":0},{"$f":"'GSM 900'!$K$18","v":0},{"$f":"'GSM 900'!$M$18","v":0},{"$f":"'GSM 900'!$O$18","v":0},{"$f":"'GSM 900'!$Q$18","v":0}]
[null,"Markası:",null,{"$f":"'GSM 900'!$C$20","v":0},{"$f":"'GSM 900'!$E$20","v":0},{"$f":"'GSM 900'!$G$20","v":0},{"$f":"'GSM 900'!$I$20","v":0},{"$f":"'GSM 900'!$K$20","v":0},{"$f":"'GSM 900'!$M$20","v":0},{"$f":"'GSM 900'!$O$20","v":0},{"$f":"'GSM 900'!$Q$20","v":0}]
[null,"Modeli:",null,{"$f":"'GSM 900'!$C$22","v":0},{"$f":"'GSM 900'!$E$22","v":0},{"$f":"'GSM 900'!$G$22","v":0},{"$f":"'GSM 900'!$I$22","v":0},{"$f":"'GSM 900'!$K$22","v":0},{"$f":"'GSM 900'!$M$22","v":0},{"$f":"'GSM 900'!$O$22","v":0},{"$f":"'GSM 900'!$Q$22","v":0}]
[null,"Antenin Yüksekliği (m)(1):",null,{"$f":"'GSM 900'!$C$26","v":0},{"$f":"'GSM 900'!$E$26","v":0},{"$f":"'GSM 900'!$G$26","v":0},{"$f":"'GSM 900'!$I$26","v":0},{"$f":"'GSM 900'!$K$26","v":0},{"$f":"'GSM 900'!$M$26","v":0},{"$f":"'GSM 900'!$O$26","v":0},{"$f":"'GSM 900'!$Q$26","v":0}]
[null,"Kazancı (dBi):",null,{"$f":"'GSM 900'!$C$28","v":0},{"$f":"'GSM 900'!$E$28","v":0},{"$f":"'GSM 900'!$G$28","v":0},{"$f":"'GSM 900'!$I$28","v":0},{"$f":"'GSM 900'!$K$28","v":0},{"$f":"'GSM 900'!$M$28","v":0},{"$f":"'GSM 900'!$O$28","v":0},{"$f":"'GSM 900'!$Q$28","v":0}]
[null,"Kullanılacak Çıkış Gücü (W):",null,{"$f":"'GSM 900'!$C$30","v":0},{"$f":"'GSM 900'!$E$30","v":0},{"$f":"'GSM 900'!$G$30","v":0},{"$f":"'GSM 900'!$I$30","v":0},{"$f":"'GSM 900'!$K$30","v":0},{"$f":"'GSM 900'!$M$30","v":0},{"$f":"'GSM 900'!$O$30","v":0},{"$f":"'GSM 900'!$Q$30","v":0}]
[null,"Yöneliş (Azimuth) (o):",null,{"$f":"'GSM 900'!$C$32","v":0},{"$f":"'GSM 900'!$E$32","v":0},{"$f":"'GSM 900'!$G$32","v":0},{"$f":"'GSM 900'!$I$32","v":0},{"$f":"'GSM 900'!$K$32","v":0},{"$f":"'GSM 900'!$M$32","v":0},{"$f":"'GSM 900'!$O$32","v":0},{"$f":"'GSM 900'!$Q$32","v":0}]
[null,"Mekanik Eğim (Tilt)(o):",null,{"$f":"'GSM 900'!$C$34","v":0},{"$f":"'GSM 900'!$E$34","v":0},{"$f":"'GSM 900'!$G$34","v":0},{"$f":"'GSM 900'!$I$34","v":0},{"$f":"'GSM 900'!$K$34","v":0},{"$f":"'GSM 900'!$M$34","v":0},{"$f":"'GSM 900'!$O$34","v":0},{"$f":"'GSM 900'!$Q$34","v":0}]
[null,"Elektronik Eğim (Tilt)(o):",null,{"$f":"'GSM 900'!$C$36","v":0},{"$f":"'GSM 900'!$E$36","v":0},{"$f":"'GSM 900'!$G$36","v":0},{"$f":"'GSM 900'!$I$36","v":0},{"$f":"'GSM 900'!$K$36","v":0},{"$f":"'GSM 900'!$M$36","v":0},{"$f":"'GSM 900'!$O$36","v":0},{"$f":"'GSM 900'!$Q$36","v":0}]
[null,"Güvenlik Mesafesi (m):",null,{"$f":"(SQRT(D16*30*(POWER(10,(D15/10)))))/10.23","v":0},{"$f":"(SQRT(E16*30*(POWER(10,(E15/10)))))/10.23","v":0},0,0,0,0,0,0]
[]
[]
["GSM 1800","K- Sistem Bilgileri"]
[null,"RBS BİLGİLERİ",null,null,"RBS 1","RBS 2"]
[null,"Marka:",null,null,{"$f":"'GSM 1800'!$C$3","v":0},{"$f":"'GSM 1800'!$E$3","v":0}]
[null,"Model:",null,null,{"$f":"'GSM 1800'!$C$5","v":0},{"$f":"'GSM 1800'!$E$5","v":0}]
[null,"Katalog Çıkış Gücü (W):",null,null,{"$f":"'GSM 1800'!$C$7","v":0},{"$f":"'GSM 1800'!$E$7","v":0}]
[null,"Cihazın Desteklediği Maksimum Kanal Sayısı:",null,null,{"$f":"'GSM 1800'!$C$9","v":0},{"$f":"'GSM 1800'!$E$9","v":0}]
[null,"Kullanılacak Kanal Sayısı:",null,null,{"$f":"'GSM 1800'!$C$11","v":0},{"$f":"'GSM 1800'!$E$11","v":0}]
[null,"Tek Kanala ait Band Genişliği (KHz):",null,null,{"$f":"'GSM 1800'!$C$13","v":0},{"$f":"'GSM 1800'!$E$13","v":0}]
[null,"L- Sektör Bilgileri"]
[null,"ANTEN BİLGİLERİ",null,"Sektör 1",null,"Sektör 2",null,"Sektör 3",null,"Sektör 4"]
[null,"Anten sayısı:",null,{"$f":"'GSM 1800'!$C$18","v":0},{"$f":"'GSM 1800'!$E$18","v":0},{"$f":"'GSM 1800'!$G$18","v":0},{"$f":"'GSM 1800'!$I$18","v":0},{"$f":"'GSM 1800'!$K$18","v":0},{"$f":"'GSM 1800'!$M$18","v":0},{"$f":"'GSM 1800'!$O$18","v":0},{"$f":"'GSM 1800'!$Q$18","v":0}]
[null,"Markası:",null,{"$f":"'GSM 1800'!$C$20","v":0},{"$f":"'GSM 1800'!$E$20","v":0},{"$f":"'GSM 1800'!$G$20","v":0},{"$f":"'GSM 1800'!$I$20","v":0},{"$f":"'GSM 1800'!$K$20","v":0},{"$f":"'GSM 1800'!$M$20","v":0},{"$f":"'GSM 1800'!$O$20","v":0},{"$f":"'GSM 1800'!$Q$20","v":0}]
[null,"Modeli:",null,{"$f":"'GSM 1800'!$C$22","v":0},{"$f":"'GSM 1800'!$E$22","v":0},{"$f":"'GSM 1800'!$G$22","v":0},{"$f":"'GSM 1800'!$I$22","v":0},{"$f":"'GSM 1800'!$K$22","v":0},{"$f":"'GSM 1800'!$M$22","v":0},{"$f":"'GSM 1800'!$O$22","v":0},{"$f":"'GSM 1800'!$Q$22","v":0}]
[null,"Antenin Yüksekliği (m)(1):",null,{"$f":"'GSM 1800'!$C$26","v":0},{"$f":"'GSM 1800'!$E$26","v":0},{"$f":"'GSM 1800'!$G$26","v":0},{"$f":"'GSM 1800'!$I$26","v":0},{"$f":"'GSM 1800'!$K$26","v":0},{"$f":"'GSM 1800'!$M$26","v":0},{"$f":"'GSM 1800'!$O$26","v":0},{"$f":"'GSM 1800'!$Q$26","v":0}]
[null,"Kazancı (dBi):",null,{"$f":"'GSM 1800'!$C$28","v":0},{"$f":"'GSM 1800'!$E$28","v":0},{"$f":"'GSM 1800'!$G$28","v":0},{"$f":"'GSM 1800'!$I$28","v":0},{"$f":"'GSM 1800'!$K$28","v":0},{"$f":"'GSM 1800'!$M$28","v":0},{"$f":"'GSM 1800'!$O$28","v":0},{"$f":"'GSM 1800'!$Q$28","v":0}]
[null,"Kullanılacak Çıkış Gücü (W):",null,{"$f":"'GSM 1800'!$C$30","v":0},{"$f":"'GSM 1800'!$E$30","v":0},{"$f":"'GSM 1800'!$G$30","v":0},{"$f":"'GSM 1800'!$I$30","v":0},{"$f":"'GSM 1800'!$K$30","v":0},{"$f":"'GSM 1800'!$M$30","v":0},{"$f":"'GSM 1800'!$O$30","v":0},{"$f":"'GSM 1800'!$Q$30","v":0}]
[null,"Yöneliş (Azimuth) (o):",null,{"$f":"'GSM 1800'!$C$32","v":0},{"$f":"'GSM 1800'!$E$32","v":0},{"$f":"'GSM 1800'!$G$32","v":0},{"$f":"'GSM 1800'!$I$32","v":0},{"$f":"'GSM 1800'!$K$32","v":0},{"$f":"'GSM 1800'!$M$32","v":0},{"$f":"'GSM 1800'!$O$32","v":0},{"$f":"'GSM 1800'!$Q$32","v":0}]
[null,"Mekanik Eğim (Tilt)(o):",null,{"$f":"'GSM 1800'!$C$34","v":0},{"$f":"'GSM 1800'!$E$34","v":0},{"$f":"'GSM 1800'!$G$34","v":0},{"$f":"'GSM 1800'!$I$34","v":0},{"$f":"'GSM 1800'!$K$34","v":0},{"$f":"'GSM 1800'!$M$34","v":0},{"$f":"'GSM 1800'!$O$34","v":0},{"$f":"'GSM 1800'!$Q$34","v":0}]
[null,"Elektronik Eğim (Tilt)(o):",null,{"$f":"'GSM 1800'!$C$36","v":0},{"$f":"'GSM 1800'!$E$36","v":0},{"$f":"'GSM 1800'!$G$36","v":0},{"$f":"'GSM 1800'!$I$36","v":0},{"$f":"'GSM 1800'!$K$36","v":0},{"$f":"'GSM 1800'!$M$36","v":0},{"$f":"'GSM 1800'!$O$36","v":0},{"$f":"'GSM 1800'!$Q$36","v":0}]
[null,"Güvenlik Mesafesi (m):",null,{"$f":"(SQRT(D38*30*(POWER(10,(D37/10)))))/14.46","v":0},{"$f":"(SQRT(E38*30*(POWER(10,(E37/10)))))/14.46","v":0},0,0,0,0,0,{"$f":"(SQRT(K38*30*(POWER(10,(K37/10)))))/14.46","v":0}]
[]
[]
["UMTS 2100","M- Sistem Bilgileri"]
[null,"RBS BİLGİLERİ",null,null,"RBS 1","RBS 2"]
[null,"Marka:",null,null,{"$f":"'UMTS 2100'!$C$3","v":0},{"$f":"'UMTS 2100'!$E$3","v":0}]
[null,"Model:",null,null,{"$f":"'UMTS 2100'!$C$5","v":0},{"$f":"'UMTS 2100'!$E$5","v":0}]
[null,"Katalog Çıkış Gücü (W):",null,null,{"$f":"'UMTS 2100'!$C$7","v":0},{"$f":"'UMTS 2100'!$E$7","v":0}]
[null,"Cihazın Desteklediği Maksimum Kanal Sayısı:",null,null,{"$f":"'UMTS 2100'!$C$9","v":0},{"$f":"'UMTS 2100'!$E$9","v":0}]
[null,"Kullanılacak Kanal Sayısı:",null,null,{"$f":"'UMTS 2100'!$C$11","v":0},{"$f":"'UMTS 2100'!$E$11","v":0}]
[null,"Tek Kanala ait Band Genişliği (MHz):",null,null,{"$f":"'UMTS 2100'!$C$13","v":0},{"$f":"'UMTS 2100'!$E$13","v":0}]
[null,"N- Sektör Bilgileri"]
[null,"ANTEN BİLGİLERİ",null,"Sektör 1",null,"Sektör 2",null,"Sektör 3",null,"Sektör 4"]
[null,"Anten sayısı:",null,{"$f":"'UMTS 2100'!$C$18","v":0},{"$f":"'UMTS 2100'!$E$18","v":0},{"$f":"'UMTS 2100'!$G$18","v":0},{"$f":"'UMTS 2100'!$I$18","v":0},{"$f":"'UMTS 2100'!$K$18","v":0},{"$f":"'UMTS 2100'!$M$18","v":0},{"$f":"'UMTS 2100'!$O$18","v":0},{"$f":"'UMTS 2100'!$Q$18","v":0}]
[null,"Markası:",null,{"$f":"'UMTS 2100'!$C$20","v":0},{"$f":"'UMTS 2100'!$E$20","v":0},{"$f":"'UMTS 2100'!$G$20","v":0},{"$f":"'UMTS 2100'!$I$20","v":0},{"$f":"'UMTS 2100'!$K$20","v":0},{"$f":"'UMTS 2100'!$M$20","v":0},{"$f":"'UMTS 2100'!$O$20","v":0},{"$f":"'UMTS 2100'!$Q$20","v":0}]
[null,"Modeli:",null,{"$f":"'UMTS 2100'!$C$22","v":0},{"$f":"'UMTS 2100'!$E$22","v":0},{"$f":"'UMTS 2100'!$G$22","v":0},{"$f":"'UMTS 2100'!$I$22","v":0},{"$f":"'UMTS 2100'!$K$22","v":0},{"$f":"'UMTS 2100'!$M$22","v":0},{"$f":"'UMTS 2100'!$O$22","v":0},{"$f":"'UMTS 2100'!$Q$22","v":0}]
[null,"Antenin Yüksekliği (m)(1):",null,{"$f":"'UMTS 2100'!$C$26","v":0},{"$f":"'UMTS 2100'!$E$26","v":0},{"$f":"'UMTS 2100'!$G$26","v":0},{"$f":"'UMTS 2100'!$I$26","v":0},{"$f":"'UMTS 2100'!$K$26","v":0},{"$f":"'UMTS 2100'!$M$26","v":0},{"$f":"'UMTS 2100'!$O$26","v":0},{"$f":"'UMTS 2100'!$Q$26","v":0}]
[null,"Kazancı (dBi):",null,{"$f":"'UMTS 2100'!$C$28","v":0},{"$f":"'UMTS 2100'!$E$28","v":0},{"$f":"'UMTS 2100'!$G$28","v":0},{"$f":"'UMTS 2100'!$I$28","v":0},{"$f":"'UMTS 2100'!$K$28","v":0},{"$f":"'UMTS 2100'!$M$28","v":0},{"$f":"'UMTS 2100'!$O$28","v":0},{"$f":"'UMTS 2100'!$Q$28","v":0}]
[null,"Kullanılacak Çıkış Gücü (W):",null,{"$f":"'UMTS 2100'!$C$30","v":0},{"$f":"'UMTS 2100'!$E$30","v":0},{"$f":"'UMTS 2100'!$G$30","v":0},{"$f":"'UMTS 2100'!$I$30","v":0},{"$f":"'UMTS 2100'!$K$30","v":0},{"$f":"'UMTS 2100'!$M$30","v":0},{"$f":"'UMTS 2100'!$O$30","v":0},{"$f":"'UMTS 2100'!$Q$30","v":0}]
[null,"Yöneliş (Azimuth) (o):",null,{"$f":"'UMTS 2100'!$C$32","v":0},{"$f":"'UMTS 2100'!$E$32","v":0},{"$f":"'UMTS 2100'!$G$32","v":0},{"$f":"'UMTS 2100'!$I$32","v":0},{"$f":"'UMTS 2100'!$K$32","v":0},{"$f":"'UMTS 2100'!$M$32","v":0},{"$f":"'UMTS 2100'!$O$32","v":0},{"$f":"'UMTS 2100'!$Q$32","v":0}]
[null,"Mekanik Eğim (Tilt)(o):",null,{"$f":"'UMTS 2100'!$C$34","v":0},{"$f":"'UMTS 2100'!$E$34","v":0},{"$f":"'UMTS 2100'!$G$34","v":0},{"$f":"'UMTS 2100'!$I$34","v":0},{"$f":"'UMTS 2100'!$K$34","v":0},{"$f":"'UMTS 2100'!$M$34","v":0},{"$f":"'UMTS 2100'!$O$34","v":0},{"$f":"'UMTS 2100'!$Q$34","v":0}]
[null,"Elektronik Eğim (Tilt)(o):",null,{"$f":"'UMTS 2100'!$C$36","v":0},{"$f":"'UMTS 2100'!$E$36","v":0},{"$f":"'UMTS 2100'!$G$36","v":0},{"$f":"'UMTS 2100'!$I$36","v":0},{"$f":"'UMTS 2100'!$K$36","v":0},{"$f":"'UMTS 2100'!$M$36","v":0},{"$f":"'UMTS 2100'!$O$36","v":0},{"$f":"'UMTS 2100'!$Q$36","v":0}]
[null,"Güvenlik Mesafesi (m):",null,{"$f":"(SQRT(D60*30*(POWER(10,(D59/10)))))/15","v":0},{"$f":"(SQRT(E60*30*(POWER(10,(E59/10)))))/15","v":0},0,0,0,0,0,0]
[]
[]
["LTE 1800","O- Sistem Bilgileri"]
[null,"RBS BİLGİLERİ",null,null,"RBS 1","RBS 2"]
[null,"Marka:",null,null,{"$f":"'LTE 1800'!$C$3","v":0},{"$f":"'LTE 1800'!$E$3","v":0}]
[null,"Model:",null,null,{"$f":"'LTE 1800'!$C$5","v":0},{"$f":"'LTE 1800'!$E$5","v":0}]
[null,"Katalog Çıkış Gücü (W):",null,null,{"$f":"'LTE 1800'!$C$7","v":0},{"$f":"'LTE 1800'!$E$7","v":0}]
[null,"Cihazın Desteklediği Maksimum Kanal Sayısı:",null,null,{"$f":"'LTE 1800'!$C$9","v":0},{"$f":"'LTE 1800'!$E$9","v":0}]
[null,"Kullanılacak Kanal Sayısı:",null,null,{"$f":"'LTE 1800'!$C$11","v":0},{"$f":"'LTE 1800'!$E$11","v":0}]
[null,"Tek Kanala ait Band Genişliği (MHz):",null,null,{"$f":"'LTE 1800'!$C$13","v":0},{"$f":"'LTE 1800'!$E$13","v":0}]
[null,"P- Sektör Bilgileri"]
[null,"ANTEN BİLGİLERİ",null,"Sektör 1",null,"Sektör 2",null,"Sektör 3",null,"Sektör 4"]
[null,"Anten sayısı:",null,{"$f":"'LTE 1800'!$C$18","v":0},{"$f":"'LTE 1800'!$E$18","v":0},{"$f":"'LTE 1800'!$G$18","v":0},{"$f":"'LTE 1800'!$I$18","v":0},{"$f":"'LTE 1800'!$K$18","v":0},{"$f":"'LTE 1800'!$M$18","v":0},{"$f":"'LTE 1800'!$O$18","v":0},{"$f":"'LTE 1800'!$Q$18","v":0}]
[null,"Markası:",null,{"$f":"'LTE 1800'!$C$20","v":0},{"$f":"'LTE 1800'!$E$20","v":0},{"$f":"'LTE 1800'!$G$20","v":0},{"$f":"'LTE 1800'!$I$20","v":0},{"$f":"'LTE 1800'!$K$20","v":0},{"$f":"'LTE 1800'!$M$20","v":0},{"$f":"'LTE 1800'!$O$20","v":0},{"$f":"'LTE 1800'!$Q$20","v":0}]
[null,"Modeli:",null,{"$f":"'LTE 1800'!$C$22","v":0},{"$f":"'LTE 1800'!$E$22","v":0},{"$f":"'LTE 1800'!$G$22","v":0},{"$f":"'LTE 1800'!$I$22","v":0},{"$f":"'LTE 1800'!$K$22","v":0},{"$f":"'LTE 1800'!$M$22","v":0},{"$f":"'LTE 1800'!$O$22","v":0},{"$f":"'LTE 1800'!$Q$22","v":0}]
[null,"Antenin Yüksekliği (m)(1):",null,{"$f":"'LTE 1800'!$C$26","v":0},{"$f":"'LTE 1800'!$E$26","v":0},{"$f":"'LTE 1800'!$G$26","v":0},{"$f":"'LTE 1800'!$I$26","v":0},{"$f":"'LTE 1800'!$K$26","v":0},{"$f":"'LTE 1800'!$M$26","v":0},{"$f":"'LTE 1800'!$O$26","v":0},{"$f":"'LTE 1800'!$Q$26","v":0}]
[null,"Kazancı (dBi):",null,{"$f":"'LTE 1800'!$C$28","v":0},{"$f":"'LTE 1800'!$E$28","v":0},{"$f":"'LTE 1800'!$G$28","v":0},{"$f":"'LTE 1800'!$I$28","v":0},{"$f":"'LTE 1800'!$K$28","v":0},{"$f":"'LTE 1800'!$M$28","v":0},{"$f":"'LTE 1800'!$O$28","v":0},{"$f":"'LTE 1800'!$Q$28","v":0}]
[null,"Kullanılacak Çıkış Gücü (W):",null,{"$f":"'LTE 1800'!$C$30","v":0},{"$f":"'LTE 1800'!$E$30","v":0},{"$f":"'LTE 1800'!$G$30","v":0},{"$f":"'LTE 1800'!$I$30","v":0},{"$f":"'LTE 1800'!$K$30","v":0},{"$f":"'LTE 1800'!$M$30","v":0},{"$f":"'LTE 1800'!$O$30","v":0},{"$f":"'LTE 1800'!$Q$30","v":0}]
[null,"Yöneliş (Azimuth) (o):",null,{"$f":"'LTE 1800'!$C$32","v":0},{"$f":"'LTE 1800'!$E$32","v":0},{"$f":"'LTE 1800'!$G$32","v":0},{"$f":"'LTE 1800'!$I$32","v":0},{"$f":"'LTE 1800'!$K$32","v":0},{"$f":"'LTE 1800'!$M$32","v":0},{"$f":"'LTE 1800'!$O$32","v":0},{"$f":"'LTE 1800'!$Q$32","v":0}]
[null,"Mekanik Eğim (Tilt)(o):",null,{"$f":"'LTE 1800'!$C$34","v":0},{"$f":"'LTE 1800'!$E$34","v":0},{"$f":"'LTE 1800'!$G$34","v":0},{"$f":"'LTE 1800'!$I$34","v":0},{"$f":"'LTE 1800'!$K$34","v":0},{"$f":"'LTE 1800'!$M$34","v":0},{"$f":"'LTE 1800'!$O$34","v":0},{"$f":"'LTE 1800'!$Q$34","v":0}]
[null,"Elektronik Eğim (Tilt)(o):",null,{"$f":"'LTE 1800'!$C$36","v":0},{"$f":"'LTE 1800'!$E$36","v":0},{"$f":"'LTE 1800'!$G$36","v":0},{"$f":"'LTE 1800'!$I$36","v":0},{"$f":"'LTE 1800'!$K$36","v":0},{"$f":"'LTE 1800'!$M$36","v":0},{"$f":"'LTE 1800'!$O$36","v":0},{"$f":"'LTE 1800'!$Q$36","v":0}]
[null,"Güvenlik Mesafesi (m):",null,{"$f":"(SQRT(D82*30*(POWER(10,(D81/10)))))/14.46","v":0},{"$f":"(SQRT(E82*30*(POWER(10,(E81/10)))))/14.46","v":0},0,0,0,0,0,0]